Skip to main content

Thread: Problem 'make' ieee80211-1.2.18


well, im having problems , read code


code:
terminator557@dissimulo:~/ieee80211-1.2.18$ sudo make inc=/path/to/kernel-headers/include/  makefile:17:   makefile:18: warning: $shell not set bash.  makefile:19: if experience build errors, try  makefile:20: 'make shell=/bin/bash'.  makefile:21:   checking in /lib/modules/2.6.31-16-generic ieee80211 components...  make -c /lib/modules/2.6.31-16-generic/build m=/home/terminator557/ieee80211-1.2.18 modules  make[1]: entering directory `/usr/src/linux-headers-2.6.31-16-generic'  /home/terminator557/ieee80211-1.2.18/makefile:17:   /home/terminator557/ieee80211-1.2.18/makefile:18: warning: $shell not set bash.  /home/terminator557/ieee80211-1.2.18/makefile:19: if experience build errors, try  /home/terminator557/ieee80211-1.2.18/makefile:20: 'make shell=/bin/bash'.  /home/terminator557/ieee80211-1.2.18/makefile:21:     cc [m]  /home/terminator557/ieee80211-1.2.18/ieee80211_module.o  /home/terminator557/ieee80211-1.2.18/ieee80211_module.c: in function ‘alloc_ieee80211’:  /home/terminator557/ieee80211-1.2.18/ieee80211_module.c:148: error: ‘struct net_device’ has no member named ‘hard_start_xmit’  /home/terminator557/ieee80211-1.2.18/ieee80211_module.c:149: error: ‘struct net_device’ has no member named ‘change_mtu’  /home/terminator557/ieee80211-1.2.18/ieee80211_module.c:153: error: ‘struct net_device’ has no member named ‘get_stats’  /home/terminator557/ieee80211-1.2.18/ieee80211_module.c: in function ‘ieee80211_init’:  /home/terminator557/ieee80211-1.2.18/ieee80211_module.c:268: error: ‘proc_net’ undeclared (first use in function)  /home/terminator557/ieee80211-1.2.18/ieee80211_module.c:268: error: (each undeclared identifier reported once  /home/terminator557/ieee80211-1.2.18/ieee80211_module.c:268: error: each function appears in.)  /home/terminator557/ieee80211-1.2.18/ieee80211_module.c: in function ‘ieee80211_exit’:  /home/terminator557/ieee80211-1.2.18/ieee80211_module.c:297: error: ‘proc_net’ undeclared (first use in function)  make[2]: *** [/home/terminator557/ieee80211-1.2.18/ieee80211_module.o] error 1  make[1]: *** [_module_/home/terminator557/ieee80211-1.2.18] error 2  make[1]: leaving directory `/usr/src/linux-headers-2.6.31-16-generic'  make: *** [modules] error 2  terminator557@dissimulo:~/ieee80211-1.2.18$

same problems here...also

code:
sudo make shell=/bin/bash
doesn't work


Forum The Ubuntu Forum Community Ubuntu Official Flavours Support Networking & Wireless [ubuntu] Problem 'make' ieee80211-1.2.18


Ubuntu

Comments

Popular posts from this blog

DHT11 Time out error using v0.4.1library

Sketch upload fails with Java error (___REMOVE___/bin/avrdude)!

Arduino Uno + KTY81/210 temperature sensor